{"text_format":"1","workbook":"xlsx","n_sheets":8,"sheets":["Accueil","Base","Vendeurs","Produits","TCD","Feuil1","Plan","Param"],"not_rendered":{"charts":0,"images":3,"macros":0,"external_links":0,"defined_names":8,"comments":0,"pivot_tables":4},"unopened":[],"bounds":{"document_bytes":16777216,"sheet_cells":100000,"rows_first":2000,"rows_last":500,"rows_between":2000,"halvings":0,"cell_chars":16384,"cell_head_chars":4096},"cells_cut":0,"cells_raw":0,"read":"whole","date_system":"1900"}

{"sheet":"Accueil","index":0,"n_rows":2,"n_cols":2,"rows_kept":2,"cut":false,"hidden":false,"merged":[[1,1,1,7]]}
[]
[null,"Les quatres grands DANGERS des TCD"]

{"sheet":"Base","index":1,"n_rows":267,"n_cols":9,"rows_kept":267,"cut":false,"hidden":false,"merged":[]}
["Clef","Date","No Vendeur","Nom","Région","Code produit","Nom du produit","Chiffre d'affaires","Unités vendues"]
[1,"2016-01-01",1,{"$f":"INDEX(TableVendeurs[Nom],MATCH(TableVentes[[#This Row],[No Vendeur]],TableVendeurs[No],0))","v":"M. Lebon"},{"$f":"INDEX(TableVendeurs[Région],MATCH(TableVentes[[#This Row],[No Vendeur]],TableVendeurs[No],0))","v":"Région Nord"},2,{"$f":"INDEX(TableProduits[Description Produit],MATCH(TableVentes[[#This Row],[Code produit]],TableProduits[Code produit],0))","v":"Produit C"},3132,157]
[2,"2016-01-01",1,{"$f":"INDEX(TableVendeurs[Nom],MATCH(TableVentes[[#This Row],[No Vendeur]],TableVendeurs[No],0))","v":"M. Lebon"},{"$f":"INDEX(TableVendeurs[Région],MATCH(TableVentes[[#This Row],[No Vendeur]],TableVendeurs[No],0))","v":"Région Nord"},3,{"$f":"INDEX(TableProduits[Description Produit],MATCH(TableVentes[[#This Row],[Code produit]],TableProduits[Code produit],0))","v":"Produit A"},776.1,78]
[3,"2016-01-01",2,{"$f":"INDEX(TableVendeurs[Nom],MATCH(TableVentes[[#This Row],[No Vendeur]],TableVendeurs[No],0))","v":"M. Dupuis"},{"$f":"INDEX(TableVendeurs[Région],MATCH(TableVentes[[#This Row],[No Vendeur]],TableVendeurs[No],0))","v":"Région Ouest"},3,{"$f":"INDEX(TableProduits[Description Produit],MATCH(TableVentes[[#This Row],[Code produit]],TableProduits[Code produit],0))","v":"Produit A"},1213.9000000000001]
[4,"2016-01-01",3,{"$f":"INDEX(TableVendeurs[Nom],MATCH(TableVentes[[#This Row],[No Vendeur]],TableVendeurs[No],0))","v":"M. Desmol"},{"$f":"INDEX(TableVendeurs[Région],MATCH(TableVentes[[#This Row],[No Vendeur]],TableVendeurs[No],0))","v":"Région Centre"},3,{"$f":"INDEX(TableProduits[Description Produit],MATCH(TableVentes[[#This Row],[Code produit]],TableProduits[Code produit],0))","v":"Produit A"},955.2,96]
[5,"2016-01-01",4,{"$f":"INDEX(TableVendeurs[Nom],MATCH(TableVentes[[#This Row],[No Vendeur]],TableVendeurs[No],0))","v":"Mme Bourguignon"},{"$f":"INDEX(TableVendeurs[Région],MATCH(TableVentes[[#This Row],[No Vendeur]],TableVendeurs[No],0))","v":"Région Est"},3,{"$f":"INDEX(TableProduits[Description Produit],MATCH(TableVentes[[#This Row],[Code produit]],TableProduits[Code produit],0))","v":"Produit A"},1273.5999999999999,128]
[6,"2016-01-01",5,{"$f":"INDEX(TableVendeurs[Nom],MATCH(TableVentes[[#This Row],[No Vendeur]],TableVendeurs[No],0))","v":"Internet"},{"$f":"INDEX(TableVendeurs[Région],MATCH(TableVentes[[#This Row],[No Vendeur]],TableVendeurs[No],0))","v":"France"},3,{"$f":"INDEX(TableProduits[Description Produit],MATCH(TableVentes[[#This Row],[Code produit]],TableProduits[Code produit],0))","v":"Produit A"},547.25,55]
[12,"2016-02-01",1,{"$f":"INDEX(TableVendeurs[Nom],MATCH(TableVentes[[#This Row],[No Vendeur]],TableVendeurs[No],0))","v":"M. Lebon"},{"$f":"INDEX(TableVendeurs[Région],MATCH(TableVentes[[#This Row],[No Vendeur]],TableVendeurs[No],0))","v":"Région Nord"},2,{"$f":"INDEX(TableProduits[Description Produit],MATCH(TableVentes[[#This Row],[Code produit]],TableProduits[Code produit],0))","v":"Produit C"},3531.15,177]
[13,"2016-02-01",2,{"$f":"INDEX(TableVendeurs[Nom],MATCH(TableVentes[[#This Row],[No Vendeur]],TableVendeurs[No],0))","v":"M. Dupuis"},{"$f":"INDEX(TableVendeurs[Région],MATCH(TableVentes[[#This Row],[No Vendeur]],TableVendeurs[No],0))","v":"Région Ouest"},2,{"$f":"INDEX(TableProduits[Description Produit],MATCH(TableVentes[[#This Row],[Code produit]],TableProduits[Code produit],0))","v":"Produit C"},5067.3,254]
[14,"2016-02-01",3,{"$f":"INDEX(TableVendeurs[Nom],MATCH(TableVentes[[#This Row],[No Vendeur]],TableVendeurs[No],0))","v":"M. Desmol"},{"$f":"INDEX(TableVendeurs[Région],MATCH(TableVentes[[#This Row],[No Vendeur]],TableVendeurs[No],0))","v":"Région Centre"},2,{"$f":"INDEX(TableProduits[Description Produit],MATCH(TableVentes[[#This Row],[Code produit]],TableProduits[Code produit],0))","v":"Produit C"},4468.8,224]
[15,"2016-02-01",4,{"$f":"INDEX(TableVendeurs[Nom],MATCH(TableVentes[[#This Row],[No Vendeur]],TableVendeurs[No],0))","v":"Mme Bourguignon"},{"$f":"INDEX(TableVendeurs[Région],MATCH(TableVentes[[#This Row],[No Vendeur]],TableVendeurs[No],0))","v":"Région Est"},2,{"$f":"INDEX(TableProduits[Description Produit],MATCH(TableVentes[[#This Row],[Code produit]],TableProduits[Code produit],0))","v":"Produit C"},5386.5,270]
[16,"2016-02-01",5,{"$f":"INDEX(TableVendeurs[Nom],MATCH(TableVentes[[#This Row],[No Vendeur]],TableVendeurs[No],0))","v":"Internet"},{"$f":"INDEX(TableVendeurs[Région],MATCH(TableVentes[[#This Row],[No Vendeur]],TableVendeurs[No],0))","v":"France"},2,{"$f":"INDEX(TableProduits[Description Produit],MATCH(TableVentes[[#This Row],[Code produit]],TableProduits[Code produit],0))","v":"Produit C"},2174.5500000000002,109]
[17,"2016-02-01",1,{"$f":"INDEX(TableVendeurs[Nom],MATCH(TableVentes[[#This Row],[No Vendeur]],TableVendeurs[No],0))","v":"M. Lebon"},{"$f":"INDEX(TableVendeurs[Région],MATCH(TableVentes[[#This Row],[No Vendeur]],TableVendeurs[No],0))","v":"Région Nord"},3,{"$f":"INDEX(TableProduits[Description Produit],MATCH(TableVentes[[#This Row],[Code produit]],TableProduits[Code produit],0))","v":"Produit A"},786.05,79]
[18,"2016-02-01",2,{"$f":"INDEX(TableVendeurs[Nom],MATCH(TableVentes[[#This Row],[No Vendeur]],TableVendeurs[No],0))","v":"M. Dupuis"},{"$f":"INDEX(TableVendeurs[Région],MATCH(TableVentes[[#This Row],[No Vendeur]],TableVendeurs[No],0))","v":"Région Ouest"},3,{"$f":"INDEX(TableProduits[Description Produit],MATCH(TableVentes[[#This Row],[Code produit]],TableProduits[Code produit],0))","v":"Produit A"},1094.5,110]
[19,"2016-02-01",3,{"$f":"INDEX(TableVendeurs[Nom],MATCH(TableVentes[[#This Row],[No Vendeur]],TableVendeurs[No],0))","v":"M. Desmol"},{"$f":"INDEX(TableVendeurs[Région],MATCH(TableVentes[[#This Row],[No Vendeur]],TableVendeurs[No],0))","v":"Région Centre"},3,{"$f":"INDEX(TableProduits[Description Produit],MATCH(TableVentes[[#This Row],[Code produit]],TableProduits[Code produit],0))","v":"Produit A"},1074.5999999999999,108]
[20,"2016-02-01",4,{"$f":"INDEX(TableVendeurs[Nom],MATCH(TableVentes[[#This Row],[No Vendeur]],TableVendeurs[No],0))","v":"Mme Bourguignon"},{"$f":"INDEX(TableVendeurs[Région],MATCH(TableVentes[[#This Row],[No Vendeur]],TableVendeurs[No],0))","v":"Région Est"},3,{"$f":"INDEX(TableProduits[Description Produit],MATCH(TableVentes[[#This Row],[Code produit]],TableProduits[Code produit],0))","v":"Produit A"},1452.7,146]
[21,"2016-02-01",5,{"$f":"INDEX(TableVendeurs[Nom],MATCH(TableVentes[[#This Row],[No Vendeur]],TableVendeurs[No],0))","v":"Internet"},{"$f":"INDEX(TableVendeurs[Région],MATCH(TableVentes[[#This Row],[No Vendeur]],TableVendeurs[No],0))","v":"France"},3,{"$f":"INDEX(TableProduits[Description Produit],MATCH(TableVentes[[#This Row],[Code produit]],TableProduits[Code produit],0))","v":"Produit A"},597,60]
[27,"2016-03-01",1,{"$f":"INDEX(TableVendeurs[Nom],MATCH(TableVentes[[#This Row],[No Vendeur]],TableVendeurs[No],0))","v":"M. Lebon"},{"$f":"INDEX(TableVendeurs[Région],MATCH(TableVentes[[#This Row],[No Vendeur]],TableVendeurs[No],0))","v":"Région Nord"},2,{"$f":"INDEX(TableProduits[Description Produit],MATCH(TableVentes[[#This Row],[Code produit]],TableProduits[Code produit],0))","v":"Produit C"},3072.3,154]
[28,"2016-03-01",2,{"$f":"INDEX(TableVendeurs[Nom],MATCH(TableVentes[[#This Row],[No Vendeur]],TableVendeurs[No],0))","v":"M. Dupuis"},{"$f":"INDEX(TableVendeurs[Région],MATCH(TableVentes[[#This Row],[No Vendeur]],TableVendeurs[No],0))","v":"Région Ouest"},2,{"$f":"INDEX(TableProduits[Description Produit],MATCH(TableVentes[[#This Row],[Code produit]],TableProduits[Code produit],0))","v":"Produit C"},3970.05,199]
[29,"2016-03-01",3,{"$f":"INDEX(TableVendeurs[Nom],MATCH(TableVentes[[#This Row],[No Vendeur]],TableVendeurs[No],0))","v":"M. Desmol"},{"$f":"INDEX(TableVendeurs[Région],MATCH(TableVentes[[#This Row],[No Vendeur]],TableVendeurs[No],0))","v":"Région Centre"},2,{"$f":"INDEX(TableProduits[Description Produit],MATCH(TableVentes[[#This Row],[Code produit]],TableProduits[Code produit],0))","v":"Produit C"},3870.3,194]
[30,"2016-03-01",4,{"$f":"INDEX(TableVendeurs[Nom],MATCH(TableVentes[[#This Row],[No Vendeur]],TableVendeurs[No],0))","v":"Mme Bourguignon"},{"$f":"INDEX(TableVendeurs[Région],MATCH(TableVentes[[#This Row],[No Vendeur]],TableVendeurs[No],0))","v":"Région Est"},2,{"$f":"INDEX(TableProduits[Description Produit],MATCH(TableVentes[[#This Row],[Code produit]],TableProduits[Code produit],0))","v":"Produit C"},4468.8,224]
[31,"2016-03-01",5,{"$f":"INDEX(TableVendeurs[Nom],MATCH(TableVentes[[#This Row],[No Vendeur]],TableVendeurs[No],0))","v":"Internet"},{"$f":"INDEX(TableVendeurs[Région],MATCH(TableVentes[[#This Row],[No Vendeur]],TableVendeurs[No],0))","v":"France"},2,{"$f":"INDEX(TableProduits[Description Produit],MATCH(TableVentes[[#This Row],[Code produit]],TableProduits[Code produit],0))","v":"Produit C"},1715.7,86]
[32,"2016-03-01",1,{"$f":"INDEX(TableVendeurs[Nom],MATCH(TableVentes[[#This Row],[No Vendeur]],TableVendeurs[No],0))","v":"M. Lebon"},{"$f":"INDEX(TableVendeurs[Région],MATCH(TableVentes[[#This Row],[No Vendeur]],TableVendeurs[No],0))","v":"Région Nord"},3,{"$f":"INDEX(TableProduits[Description Produit],MATCH(TableVentes[[#This Row],[Code produit]],TableProduits[Code produit],0))","v":"Produit A"},616.9,62]
[33,"2016-03-01",2,{"$f":"INDEX(TableVendeurs[Nom],MATCH(TableVentes[[#This Row],[No Vendeur]],TableVendeurs[No],0))","v":"M. Dupuis"},{"$f":"INDEX(TableVendeurs[Région],MATCH(TableVentes[[#This Row],[No Vendeur]],TableVendeurs[No],0))","v":"Région Ouest"},3,{"$f":"INDEX(TableProduits[Description Produit],MATCH(TableVentes[[#This Row],[Code produit]],TableProduits[Code produit],0))","v":"Produit A"},875.6,88]
[34,"2016-03-01",3,{"$f":"INDEX(TableVendeurs[Nom],MATCH(TableVentes[[#This Row],[No Vendeur]],TableVendeurs[No],0))","v":"M. Desmol"},{"$f":"INDEX(TableVendeurs[Région],MATCH(TableVentes[[#This Row],[No Vendeur]],TableVendeurs[No],0))","v":"Région Centre"},3,{"$f":"INDEX(TableProduits[Description Produit],MATCH(TableVentes[[#This Row],[Code produit]],TableProduits[Code produit],0))","v":"Produit A"},796,80]
[35,"2016-03-01",4,{"$f":"INDEX(TableVendeurs[Nom],MATCH(TableVentes[[#This Row],[No Vendeur]],TableVendeurs[No],0))","v":"Mme Bourguignon"},{"$f":"INDEX(TableVendeurs[Région],MATCH(TableVentes[[#This Row],[No Vendeur]],TableVendeurs[No],0))","v":"Région Est"},3,{"$f":"INDEX(TableProduits[Description Produit],MATCH(TableVentes[[#This Row],[Code produit]],TableProduits[Code produit],0))","v":"Produit A"},1014.9,102]
[36,"2016-03-01",5,{"$f":"INDEX(TableVendeurs[Nom],MATCH(TableVentes[[#This Row],[No Vendeur]],TableVendeurs[No],0))","v":"Internet"},{"$f":"INDEX(TableVendeurs[Région],MATCH(TableVentes[[#This Row],[No Vendeur]],TableVendeurs[No],0))","v":"France"},3,{"$f":"INDEX(TableProduits[Description Produit],MATCH(TableVentes[[#This Row],[Code produit]],TableProduits[Code produit],0))","v":"Produit A"},398,40]
[42,"2016-04-01",1,{"$f":"INDEX(TableVendeurs[Nom],MATCH(TableVentes[[#This Row],[No Vendeur]],TableVendeurs[No],0))","v":"M. Lebon"},{"$f":"INDEX(TableVendeurs[Région],MATCH(TableVentes[[#This Row],[No Vendeur]],TableVendeurs[No],0))","v":"Région Nord"},2,{"$f":"INDEX(TableProduits[Description Produit],MATCH(TableVentes[[#This Row],[Code produit]],TableProduits[Code produit],0))","v":"Produit C"},2613.4499999999998,131]
[43,"2016-04-01",2,{"$f":"INDEX(TableVendeurs[Nom],MATCH(TableVentes[[#This Row],[No Vendeur]],TableVendeurs[No],0))","v":"M. Dupuis"},{"$f":"INDEX(TableVendeurs[Région],MATCH(TableVentes[[#This Row],[No Vendeur]],TableVendeurs[No],0))","v":"Région Ouest"},2,{"$f":"INDEX(TableProduits[Description Produit],MATCH(TableVentes[[#This Row],[Code produit]],TableProduits[Code produit],0))","v":"Produit C"},4289.25,215]
[44,"2016-04-01",3,{"$f":"INDEX(TableVendeurs[Nom],MATCH(TableVentes[[#This Row],[No Vendeur]],TableVendeurs[No],0))","v":"M. Desmol"},{"$f":"INDEX(TableVendeurs[Région],MATCH(TableVentes[[#This Row],[No Vendeur]],TableVendeurs[No],0))","v":"Région Centre"},2,{"$f":"INDEX(TableProduits[Description Produit],MATCH(TableVentes[[#This Row],[Code produit]],TableProduits[Code produit],0))","v":"Produit C"},3910.2,196]
[45,"2016-04-01",4,{"$f":"INDEX(TableVendeurs[Nom],MATCH(TableVentes[[#This Row],[No Vendeur]],TableVendeurs[No],0))","v":"Mme Bourguignon"},{"$f":"INDEX(TableVendeurs[Région],MATCH(TableVentes[[#This Row],[No Vendeur]],TableVendeurs[No],0))","v":"Région Est"},2,{"$f":"INDEX(TableProduits[Description Produit],MATCH(TableVentes[[#This Row],[Code produit]],TableProduits[Code produit],0))","v":"Produit C"},4369.05,219]
[46,"2016-04-01",5,{"$f":"INDEX(TableVendeurs[Nom],MATCH(TableVentes[[#This Row],[No Vendeur]],TableVendeurs[No],0))","v":"Internet"},{"$f":"INDEX(TableVendeurs[Région],MATCH(TableVentes[[#This Row],[No Vendeur]],TableVendeurs[No],0))","v":"France"},2,{"$f":"INDEX(TableProduits[Description Produit],MATCH(TableVentes[[#This Row],[Code produit]],TableProduits[Code produit],0))","v":"Produit C"},1755.6,88]
[47,"2016-04-01",1,{"$f":"INDEX(TableVendeurs[Nom],MATCH(TableVentes[[#This Row],[No Vendeur]],TableVendeurs[No],0))","v":"M. Lebon"},{"$f":"INDEX(TableVendeurs[Région],MATCH(TableVentes[[#This Row],[No Vendeur]],TableVendeurs[No],0))","v":"Région Nord"},3,{"$f":"INDEX(TableProduits[Description Produit],MATCH(TableVentes[[#This Row],[Code produit]],TableProduits[Code produit],0))","v":"Produit A"},517.4,52]
[48,"2016-04-01",2,{"$f":"INDEX(TableVendeurs[Nom],MATCH(TableVentes[[#This Row],[No Vendeur]],TableVendeurs[No],0))","v":"M. Dupuis"},{"$f":"INDEX(TableVendeurs[Région],MATCH(TableVentes[[#This Row],[No Vendeur]],TableVendeurs[No],0))","v":"Région Ouest"},3,{"$f":"INDEX(TableProduits[Description Produit],MATCH(TableVentes[[#This Row],[Code produit]],TableProduits[Code produit],0))","v":"Produit A"},815.9,82]
[49,"2016-04-01",3,{"$f":"INDEX(TableVendeurs[Nom],MATCH(TableVentes[[#This Row],[No Vendeur]],TableVendeurs[No],0))","v":"M. Desmol"},{"$f":"INDEX(TableVendeurs[Région],MATCH(TableVentes[[#This Row],[No Vendeur]],TableVendeurs[No],0))","v":"Région Centre"},3,{"$f":"INDEX(TableProduits[Description Produit],MATCH(TableVentes[[#This Row],[Code produit]],TableProduits[Code produit],0))","v":"Produit A"},776.1,78]
[50,"2016-04-01",4,{"$f":"INDEX(TableVendeurs[Nom],MATCH(TableVentes[[#This Row],[No Vendeur]],TableVendeurs[No],0))","v":"Mme Bourguignon"},{"$f":"INDEX(TableVendeurs[Région],MATCH(TableVentes[[#This Row],[No Vendeur]],TableVendeurs[No],0))","v":"Région Est"},3,{"$f":"INDEX(TableProduits[Description Produit],MATCH(TableVentes[[#This Row],[Code produit]],TableProduits[Code produit],0))","v":"Produit A"},955.2,96]
[51,"2016-04-01",5,{"$f":"INDEX(TableVendeurs[Nom],MATCH(TableVentes[[#This Row],[No Vendeur]],TableVendeurs[No],0))","v":"Internet"},{"$f":"INDEX(TableVendeurs[Région],MATCH(TableVentes[[#This Row],[No Vendeur]],TableVendeurs[No],0))","v":"France"},3,{"$f":"INDEX(TableProduits[Description Produit],MATCH(TableVentes[[#This Row],[Code produit]],TableProduits[Code produit],0))","v":"Produit A"},328.35,33]
[52,"2016-04-01",1,{"$f":"INDEX(TableVendeurs[Nom],MATCH(TableVentes[[#This Row],[No Vendeur]],TableVendeurs[No],0))","v":"M. Lebon"},{"$f":"INDEX(TableVendeurs[Région],MATCH(TableVentes[[#This Row],[No Vendeur]],TableVendeurs[No],0))","v":"Région Nord"},1,{"$f":"INDEX(TableProduits[Description Produit],MATCH(TableVentes[[#This Row],[Code produit]],TableProduits[Code produit],0))","v":"Produit B"},79.8,4]
[53,"2016-04-01",2,{"$f":"INDEX(TableVendeurs[Nom],MATCH(TableVentes[[#This Row],[No Vendeur]],TableVendeurs[No],0))","v":"M. Dupuis"},{"$f":"INDEX(TableVendeurs[Région],MATCH(TableVentes[[#This Row],[No Vendeur]],TableVendeurs[No],0))","v":"Région Ouest"},1,{"$f":"INDEX(TableProduits[Description Produit],MATCH(TableVentes[[#This Row],[Code produit]],TableProduits[Code produit],0))","v":"Produit B"},99.75,5]
[54,"2016-04-01",3,{"$f":"INDEX(TableVendeurs[Nom],MATCH(TableVentes[[#This Row],[No Vendeur]],TableVendeurs[No],0))","v":"M. Desmol"},{"$f":"INDEX(TableVendeurs[Région],MATCH(TableVentes[[#This Row],[No Vendeur]],TableVendeurs[No],0))","v":"Région Centre"},1,{"$f":"INDEX(TableProduits[Description Produit],MATCH(TableVentes[[#This Row],[Code produit]],TableProduits[Code produit],0))","v":"Produit B"},119.7,6]
{"$rows_left_out":228}
{"sheet":"Vendeurs","index":2,"n_rows":6,"n_cols":3,"rows_kept":6,"cut":false,"hidden":false,"merged":[]}
["No","Nom","Région"]
[1,"M. Lebon","Région Nord"]
[2,"M. Dupuis","Région Ouest"]
[3,"M. Desmol","Région Centre"]
[4,"Mme Bourguignon","Région Est"]
[5,"Internet","France"]

{"sheet":"Produits","index":3,"n_rows":4,"n_cols":2,"rows_kept":4,"cut":false,"hidden":false,"merged":[]}
["Code produit","Description Produit"]
[1,"Produit B"]
[2,"Produit C"]
[3,"Produit A"]

{"sheet":"TCD","index":4,"n_rows":20,"n_cols":4,"rows_kept":20,"cut":false,"hidden":false,"merged":[]}
[]
[]
[]
["Nom","M. Desmol"]
[]
["Nom du produit"," Chiffre d'affaires"," Unités vendues"," Prix Unitaire Moyen"]
["Produit A",31591.25,3175,9.9499999999999993]
["Produit B",14543.55,729,19.95]
["Produit C",222681.90000000005,11162,19.950000000000006]
["Total général",268816.70000000007,15066,17.842605867516262]
[]
[]
[]
["Nom","(Tous)"]
[]
["Nom du produit"," Chiffre d'affaires"," Unités vendues"," Prix Unitaire Moyen"]
["Produit A",151259.89999999997,15080,10.030497347480104]
["Produit B",69027.000000000015,3460,19.950000000000003]
["Produit C",1054556.8500000001,52860,19.949997162315551]
["Total général",1274843.75,71400,17.854954481792717]

{"sheet":"Feuil1","index":5,"n_rows":12,"n_cols":7,"rows_kept":12,"cut":false,"hidden":false,"merged":[]}
["No","Nom","CA",null,null,"Nom","Somme de CA"]
[1,"a",15,null,null,"a",15]
[2,"b",null,null,null,"b"]
[3,"c",12,null,null,"c",12]
[null,null,null,null,null,"Total général",27]
[]
[]
[null,null,null,null,null,"Nom","Somme de CA"]
["No","Nom","CA",null,null,"a",15]
[1,"a",15,null,null,"b",18]
[2,"b",18,null,null,"c",12]
[3,"c",12,null,null,"Total général",45]

{"sheet":"Plan","index":6,"n_rows":5,"n_cols":1,"rows_kept":5,"cut":false,"hidden":false,"merged":[]}
[{"$f":"INDEX(A2:A5,Param!B1)","v":"Danger 4. Nombre au lieu de Somme"}]
["Danger 1. Transmettre des informations confidentielles à un tiers"]
["Danger 2. Oubli de l’actualisation des données"]
["Danger 3. Aller trop vite dans l'analyse "]
["Danger 4. Nombre au lieu de Somme"]

{"sheet":"Param","index":7,"n_rows":1,"n_cols":2,"rows_kept":1,"cut":false,"hidden":false,"merged":[]}
["Règle en cours : ",4]